{"text_format":"1","workbook":"xlsx","n_sheets":12,"sheets":["READ ME","Design Table","Proposed Velocity","Proposed Competence","Existing a","Existing b","Existing Competence","Existing Bank Erosion","Reference a","Reference b","Reference Competence","Reference Bank Erosion"],"not_rendered":{"charts":0,"images":15,"macros":1,"external_links":0,"defined_names":162,"comments":0,"pivot_tables":0},"unopened":[],"bounds":{"document_bytes":16777216,"sheet_cells":100000,"rows_first":2000,"rows_last":500,"rows_between":2000,"halvings":0,"cell_chars":16384,"cell_head_chars":4096},"cells_cut":0,"cells_raw":0,"read":"whole","date_system":"1900"}

{"sheet":"READ ME","index":0,"n_rows":18,"n_cols":2,"rows_kept":18,"cut":false,"hidden":false,"merged":[[1,0,1,1],[2,0,2,1],[0,0,0,1],[6,0,6,1],[17,0,17,1]]}
["The Design Table Template"]
["The Design Table coincides with Phase 6 - Develop & Evaluate the Prelimanary Natural Channel Design.  You should complete the Design Table in the same sequence as outlined in Phase 6."]
["About the Design Table (see Blue-Tabbed Worksheet titled \"Design Table\"):"]
["1.","You can use the buttons at the top of the display for easy navigation."]
["2.","There are numerous formulas within the Design Table and therefore the cells are locked so that you don't accidently delete formulas; you can unlock the cells by unprotecting the worksheet under \"Tools\" and \"Protection\" (Excel 2003), or \"File\" and \"Permissions\" (Excel 2007/2010)."]
["3.","The bolded numbers in the Design Table coincide with the Entry numbers in Phase 6."]
{"$rows_left_out":13}
{"sheet":"Design Table","index":1,"n_rows":421,"n_cols":11,"rows_kept":421,"cut":false,"hidden":false,"merged":[[389,5,390,6],[389,7,390,8],[391,1,392,1],[391,2,392,2],[391,3,392,4],[391,5,392,6],[391,7,392,8],[377,0,392,0],[385,1,386,1],[385,2,386,2],[385,3,386,4],[385,5,386,6],[385,7,386,8],[387,1,388,1],[387,2,388,2],[387,3,388,4],[387,5,388,6],[387,7,388,8],[381,1,382,1],[381,2,382,2],[381,3,382,4],[381,5,382,6],[381,7,382,8],[383,1,384,1],[383,2,384,2],[383,3,384,4],[383,5,384,6],[383,7,384,8],[389,1,390,1],[389,2,390,2],[389,3,390,4],[356,0,376,0],[360,3,360,4],[360,5,360,6],[360,7,360,8],[361,3,361,4],[361,5,361,6],[361,7,361,8],[362,3,362,4],[362,5,362,6],[362,7,362,8],[356,2,356,8],[357,3,357,4],[357,5,357,6],[357,7,357,8],[358,3,358,4],[358,5,358,6],[358,7,358,8],[376,3,376,4],[376,5,376,6],[262,7,263,8],[8,7,8,8],[373,5,373,6],[375,5,375,6],[365,7,365,8],[10,7,10,8],[9,7,9,8],[11,7,11,8],[266,5,266,6],[267,5,268,6],[396,5,396,6],[393,5,393,6],[258,5,259,6],[264,5,265,5],[264,6,265,6],[258,3,259,4],[396,7,396,8],[365,5,365,6],[366,5,366,6],[367,5,367,6],[365,3,365,4],[366,3,366,4],[371,7,371,8],[369,7,369,8],[364,7,364,8],[266,7,268,8],[368,7,368,8],[379,5,380,6],[373,7,373,8],[364,5,364,6],[368,5,368,6],[363,2,363,8],[374,7,374,8],[375,7,375,8],[0,10,4,14],[0,4,0,7],[7,3,7,4],[7,5,7,6],[8,3,8,4],[6,7,6,8],[7,7,7,8],[6,3,6,4],[6,5,6,6],[3,3,3,8],[0,0,0,2],[9,3,9,4],[275,0,280,0],[275,1,277,1],[275,2,277,2],[278,1,280,1],[278,2,280,2],[281,1,283,1],[281,2,283,2],[269,1,271,1],[269,2,271,2],[272,1,274,1],[272,2,274,2],[6,0,6,2],[5,0,5,2],[4,0,4,2],[4,3,4,8],[5,3,5,8],[258,7,259,8],[260,3,261,4],[260,5,261,6],[260,7,261,8],[262,3,263,4],[262,5,263,6],[240,2,242,2],[317,2,319,2],[287,2,289,2],[258,2,259,2],[260,2,261,2],[262,2,263,2],[266,2,268,2],[255,2,257,2],[243,2,245,2],[246,2,248,2],[249,2,251,2],[252,2,254,2],[264,2,265,2],[284,2,286,2],[299,2,301,2],[302,2,304,2],[305,2,307,2],[296,2,298,2],[314,2,316,2],[308,2,310,2],[311,2,313,2],[210,2,212,2],[213,2,215,2],[216,2,218,2],[204,2,206,2],[207,2,209,2],[198,2,200,2],[201,2,203,2],[195,2,197,2],[237,2,239,2],[219,2,221,2],[222,2,224,2],[225,2,227,2],[228,2,230,2],[231,2,233,2],[234,2,236,2],[168,2,170,2],[183,2,185,2],[186,2,188,2],[189,2,191,2],[177,2,179,2],[180,2,182,2],[171,2,173,2],[174,2,176,2],[192,2,194,2],[153,2,155,2],[159,2,161,2],[162,2,164,2],[165,2,167,2],[156,2,158,2],[141,2,143,2],[144,2,146,2],[147,2,149,2],[150,2,152,2],[296,0,325,0],[57,1,59,1],[60,1,62,1],[63,1,65,1],[66,1,68,1],[69,1,71,1],[72,1,74,1],[180,1,182,1],[150,1,152,1],[153,1,155,1],[159,1,161,1],[156,1,158,1],[147,1,149,1],[198,1,200,1],[201,1,203,1],[195,1,197,1],[162,1,164,1],[165,1,167,1],[168,1,170,1],[183,1,185,1],[171,1,173,1],[174,1,176,1],[177,1,179,1],[213,1,215,1],[210,0,257,0],[287,0,295,0],[326,0,355,0],[281,0,286,0],[258,0,268,0],[269,0,274,0],[87,0,107,0],[144,1,146,1],[141,1,143,1],[138,1,140,1],[216,1,218,1],[219,1,221,1],[222,1,224,1],[186,1,188,1],[189,1,191,1],[192,1,194,1],[210,1,212,1],[204,1,206,1],[207,1,209,1],[237,1,239,1],[240,1,242,1],[243,1,245,1],[246,1,248,1],[225,1,227,1],[36,0,56,0],[57,0,86,0],[45,1,47,1],[48,1,50,1],[51,1,53,1],[36,1,38,1],[84,1,86,1],[87,1,89,1],[90,1,92,1],[75,1,77,1],[78,1,80,1],[81,1,83,1],[54,1,56,1],[410,5,410,6],[405,3,405,4],[410,7,410,8],[406,5,406,6],[406,3,406,4],[408,5,408,6],[409,7,409,8],[407,7,407,8],[406,7,406,8],[408,7,408,8],[405,7,405,8],[409,5,409,6],[407,5,407,6],[409,3,409,4],[408,3,408,4],[102,1,104,1],[105,1,107,1],[228,1,230,1],[231,1,233,1],[234,1,236,1],[249,1,251,1],[252,1,254,1],[255,1,257,1],[287,1,289,1],[258,1,259,1],[260,1,261,1],[262,1,263,1],[264,1,265,1],[132,1,134,1],[135,1,137,1],[284,1,286,1],[404,5,404,6],[405,5,405,6],[407,3,407,4],[99,1,101,1],[314,1,316,1],[317,1,319,1],[308,1,310,1],[320,1,322,1],[63,2,65,2],[66,2,68,2],[69,2,71,2],[72,2,74,2],[75,2,77,2],[78,2,80,2],[81,2,83,2],[99,2,101,2],[102,2,104,2],[105,2,107,2],[375,3,375,4],[379,1,380,1],[377,1,378,1],[368,3,368,4],[311,1,313,1],[397,2,398,2],[403,7,403,8],[404,7,404,8],[403,5,403,6],[403,3,403,4],[293,1,295,1],[326,1,328,1],[329,1,331,1],[338,1,340,1],[332,1,334,1],[335,1,337,1],[302,1,304,1],[305,1,307,1],[320,2,322,2],[374,3,374,4],[374,5,374,6],[393,7,393,8],[379,7,380,8],[376,7,376,8],[379,3,380,4],[377,2,378,2],[379,2,380,2],[377,5,378,6],[377,7,378,8],[394,2,395,2],[399,2,400,2],[401,2,402,2],[406,0,410,0],[393,3,393,4],[396,3,396,4],[404,3,404,4],[410,3,410,4],[406,1,406,2],[394,1,395,1],[397,1,398,1],[399,1,400,1],[401,1,402,1],[296,1,298,1],[266,1,268,1],[350,1,352,1],[293,2,295,2],[335,2,337,2],[338,2,340,2],[341,2,343,2],[326,2,328,2],[329,2,331,2],[332,2,334,2],[344,2,346,2],[347,2,349,2],[350,2,352,2],[344,1,346,1],[347,1,349,1],[299,1,301,1],[323,2,325,2],[353,1,355,1],[353,2,355,2],[372,3,372,4],[372,5,372,6],[373,3,373,4],[369,3,369,4],[369,5,369,6],[370,2,370,8],[366,7,366,8],[372,7,372,8],[367,7,367,8],[359,3,359,4],[359,5,359,6],[359,7,359,8],[371,3,371,4],[371,5,371,6],[108,2,110,2],[87,2,89,2],[90,2,92,2],[93,2,95,2],[96,2,98,2],[132,2,134,2],[135,2,137,2],[138,2,140,2],[111,2,113,2],[123,2,125,2],[126,2,128,2],[129,2,131,2],[114,2,116,2],[21,1,23,1],[11,3,11,4],[11,5,11,6],[10,3,10,4],[10,5,10,6],[8,5,8,6],[9,5,9,6],[15,2,17,2],[18,2,20,2],[21,2,23,2],[12,1,14,1],[12,2,14,2],[15,1,17,1],[18,1,20,1],[416,0,420,0],[416,1,416,2],[108,0,134,0],[135,0,161,0],[27,1,29,1],[30,1,32,1],[54,2,56,2],[57,2,59,2],[33,1,35,1],[108,1,110,1],[42,2,44,2],[117,2,119,2],[120,1,122,1],[162,0,182,0],[393,0,405,0],[117,1,119,1],[42,1,44,1],[84,2,86,2],[45,2,47,2],[48,2,50,2],[51,2,53,2],[183,0,209,0],[93,1,95,1],[323,1,325,1],[96,1,98,1],[12,0,35,0],[24,2,26,2],[27,2,29,2],[30,2,32,2],[33,2,35,2],[266,3,268,4],[377,3,378,4],[367,3,367,4],[364,3,364,4],[24,1,26,1],[290,1,292,1],[290,2,292,2],[114,1,116,1],[123,1,125,1],[120,2,122,2],[111,1,113,1],[126,1,128,1],[129,1,131,1],[36,2,38,2],[39,1,41,1],[39,2,41,2],[60,2,62,2],[341,1,343,1],[416,7,416,8],[417,3,417,4],[417,5,417,6],[417,7,417,8],[420,7,420,8],[418,7,418,8],[419,3,419,4],[419,5,419,6],[419,7,419,8],[416,3,416,4],[416,5,416,6],[418,3,418,4],[418,5,418,6],[420,3,420,4],[420,5,420,6],[411,0,415,0],[411,1,411,2],[411,3,411,4],[411,5,411,6],[411,7,411,8],[412,3,412,4],[412,5,412,6],[412,7,412,8],[413,3,413,4],[413,5,413,6],[413,7,413,8],[414,3,414,4],[414,5,414,6],[414,7,414,8],[415,3,415,4],[415,5,415,6],[415,7,415,8]]}
[null,null,null,null,null,null,null,null,null,null,"NOTE:  Numerous cells contain formulas and therefore the cells are locked; to unlock cells, unprotect sheet under \"Tools\" & \"Protection\" (2003) or \"File\" & \"Permissions\" (2007/2010)"]
[null,null,{"$f":"IF('Existing a'!G38=\"\",\"\",'Existing a'!G38)","v":""}]
[]
[null,null,null,"\"Ave\" = Average   \"LL\" = Lower Limit    \"UL\" = Upper Limit"]
["Existing Reach Stream & Location:"]
["Reference Reach Stream & Location:"]
{"$rows_left_out":416}
{"sheet":"Proposed Velocity","index":2,"n_rows":61,"n_cols":28,"rows_kept":61,"cut":false,"hidden":false,"merged":[[52,1,52,10],[58,19,60,25],[48,1,48,10],[48,12,50,12],[48,13,50,13],[48,15,50,15],[48,16,50,16],[49,2,49,5],[44,1,44,10],[44,12,46,12],[44,13,46,13],[44,15,46,15],[44,16,46,16],[45,2,45,9],[40,1,40,10],[40,12,42,12],[40,13,42,13],[40,15,42,15],[40,16,42,16],[41,2,41,9],[35,16,36,16],[36,7,36,9],[31,1,31,4],[31,7,31,9],[31,12,33,12],[31,13,33,13],[31,15,33,15],[31,16,33,16],[35,1,35,4],[35,7,35,9],[35,12,36,12],[35,13,36,13],[35,15,36,15],[23,15,23,16],[25,1,25,10],[27,1,27,10],[27,12,29,12],[27,13,29,13],[27,15,29,15],[27,16,29,16],[19,1,19,4],[19,9,19,13],[21,1,21,4],[21,9,21,13],[23,1,23,10],[23,12,23,13],[13,1,13,4],[13,9,13,13],[15,1,15,4],[15,9,15,13],[17,1,17,4],[17,9,17,13],[7,1,7,2],[7,3,7,7],[9,1,9,7],[9,9,9,16],[11,1,11,4],[11,9,11,13],[5,1,5,2],[5,4,5,6],[5,9,5,12],[5,13,5,16],[1,19,5,23],[1,1,1,16],[3,1,3,2],[3,3,3,7],[3,9,3,11],[3,12,3,16]]}
[]
[null,"Bankfull VELOCITY & DISCHARGE Estimates",null,null,null,null,null,null,null,null,null,null,null,null,null,null,null,null,null,"NOTE:  Numerous cells contain formulas and therefore the cells are locked; to unlock cells, unprotect sheet under \"Tools\" & \"Protection\" (2003) or \"File\" & \"Permissions\" (2007/2010)"]
[]
[null," Stream:",null,null,null,null,null,null,null,"Location:"]
[]
[null," Date:",null,null,"Stream Type:",null,null,{"$f":"IF('Design Table'!F10=\"\",\"\",'Design Table'!F10)","v":""},null,"Valley Type:",null,null,null,{"$f":"IF('Design Table'!F8=\"\",\"\",'Design Table'!F8)","v":""}]
{"$rows_left_out":56}
{"sheet":"Proposed Competence","index":3,"n_rows":34,"n_cols":14,"rows_kept":34,"cut":false,"hidden":false,"merged":[[0,13,3,18],[32,13,33,21],[25,3,26,10],[27,3,28,10],[29,3,30,10],[31,3,32,10],[33,6,33,7],[1,3,1,6],[1,7,1,8],[1,9,1,10],[2,3,2,6],[2,7,2,8],[2,9,2,10],[3,3,3,6],[3,9,3,10],[4,1,4,10],[24,1,24,2],[24,3,24,10],[12,1,12,10],[14,1,14,2],[15,1,15,2],[15,8,15,9],[17,1,17,10],[18,1,18,2],[19,1,19,10],[20,1,20,2],[21,6,21,7],[23,1,23,10],[5,1,5,2],[5,4,5,10],[6,1,6,2],[6,4,6,10],[13,1,13,2],[10,1,10,2],[10,4,10,10],[8,1,8,2],[8,4,8,10],[9,1,9,2],[9,4,9,10],[7,1,7,2],[7,4,7,7]]}
[null,null,null,null,null,null,null,null,null,null,null,null,null,"NOTE:  Numerous cells contain formulas and therefore the cells are locked; to unlock cells, unprotect sheet under \"Tools\" & \"Protection\" (2003) or \"File\" & \"Permissions\" (2007/2010)"]
[null,"Stream:  ",null,null,null,null,null,"Stream Type:",null,{"$f":"IF('Design Table'!F10=\"\",\"\",'Design Table'!F10)","v":""}]
[null,"Location:  ",null,null,null,null,null,"Valley Type:",null,{"$f":"IF('Design Table'!F8=\"\",\"\",'Design Table'!F8)","v":""}]
[null,"Observers:",null,null,null,null,null,null,"Date:"]
[null,"Enter Required Information for PROPOSED Design Condition"]
[null,{"$f":"IF('Design Table'!F367=\"\",\"\",'Design Table'!F367)","v":""},null,"D50","Median particle size of riffle bed material (mm)"]
{"$rows_left_out":29}
{"sheet":"Existing a","index":4,"n_rows":88,"n_cols":35,"rows_kept":88,"cut":false,"hidden":false,"merged":[[76,30,82,37],[1,22,6,26],[63,30,67,37],[68,29,69,29],[68,30,73,37],[74,28,74,33],[74,34,74,37],[57,30,57,33],[57,34,57,37],[59,30,59,33],[59,34,59,37],[61,30,61,33],[61,34,61,37],[50,30,50,33],[50,34,50,37],[52,30,54,33],[52,34,54,37],[55,30,55,33],[42,30,42,37],[44,30,44,37],[46,30,46,33],[46,34,46,37],[48,30,48,33],[48,34,48,37],[27,30,27,33],[27,34,27,37],[29,30,31,37],[35,28,35,31],[37,30,41,37],[20,30,22,33],[20,34,22,37],[23,30,23,33],[23,34,23,37],[25,30,25,33],[25,34,25,37],[14,30,14,33],[14,34,14,37],[16,30,16,33],[16,34,16,37],[18,30,18,33],[18,34,18,37],[1,29,2,37],[3,28,3,37],[4,30,6,37],[8,30,8,37],[12,30,12,33],[12,34,12,37],[85,0,85,20],[86,0,86,20],[87,0,87,20],[40,0,51,0],[50,10,50,16],[52,0,52,20],[53,0,70,0],[71,0,71,20],[72,0,83,0],[73,1,73,5],[82,10,82,16],[2,0,19,0],[20,0,20,20],[21,0,38,0],[84,0,84,20],[39,0,39,20],[0,0,0,1],[0,2,0,8],[0,9,0,11],[0,12,0,20],[1,0,1,1],[1,2,1,6],[1,8,1,11],[1,12,1,13],[1,14,1,15],[1,16,1,17],[1,18,1,20]]}
["Stream:",null,null,null,null,null,null,null,null,"Location:"]
["Observers:",null,null,null,null,null,null,"Date:",null,null,null,null,"Valley Type:",null,null,null,"Stream Type:",null,null,null,null,null,"This form is populated in RIVERMorph within the \"Ratios\" node by clicking on the \"Field Book\" button.  Copy the appropriate cells within the exported RIVERMorph \"Worksheet 2-4a\" and paste into cell A1.  These values are then automatically transferred to the \"Design Table\" column for the existing reach.",null,null,null,null,null,null,"Instructions to Complete Bed Feature Dimensions (Worksheet 2-4a)"]
[]
[null,"Riffle Dimensions*, **, ***",null,null,null,null,"Mean","Min","Max","Riffle Dimensions & Dimensionless Ratios****",null,null,null,null,null,null,null,"Mean","Min","Max",null,null,null,null,null,null,null,null,"Riffle Dimensions"]
[null,"Riffle Width (Wbkf)",null,null,null,null,null,null,null,"ft","Riffle Cross-Sectional Area (Abkf) (ft2)",null,null,null,null,null,null,null,null,null,null,null,null,null,null,null,null,null,null,"1.","Survey Riffle cross-sections; be sure to select and survey only those cross-sections that are representative of the reach, determined during the \"toothpick survey.\"  Multiple Riffle cross-sections are needed to determine an average and a range of values that represent Riffle dimensions."]
[]
{"$rows_left_out":83}
{"sheet":"Existing b","index":5,"n_rows":76,"n_cols":23,"rows_kept":76,"cut":false,"hidden":false,"merged":[[1,22,8,26],[72,17,72,18],[76,0,76,20],[72,1,72,3],[72,4,72,5],[72,6,72,7],[72,8,72,9],[72,12,72,13],[72,14,72,15],[61,0,73,0],[61,17,61,19],[66,14,66,15],[66,17,66,18],[68,17,68,18],[70,1,70,3],[70,4,70,5],[70,6,70,7],[70,8,70,9],[70,12,70,13],[70,14,70,15],[70,17,70,18],[68,14,68,15],[66,1,66,3],[66,4,66,5],[66,6,66,7],[66,8,66,9],[66,12,66,13],[68,1,68,3],[68,4,68,5],[68,6,68,7],[68,8,68,9],[68,12,68,13],[64,14,64,15],[62,1,62,3],[62,4,62,5],[62,6,62,7],[64,17,64,18],[64,1,64,3],[64,4,64,5],[64,6,64,7],[64,8,64,9],[64,12,64,13],[57,9,57,16],[59,0,59,20],[62,8,62,9],[62,12,62,13],[62,14,62,15],[62,17,62,18],[28,0,28,20],[29,0,56,0],[30,4,30,5],[30,13,30,14],[32,4,32,5],[32,7,32,12],[32,13,32,14],[34,7,34,10],[35,7,35,10],[49,9,49,16],[51,9,51,16],[53,9,53,16],[55,9,55,16],[9,0,9,20],[10,0,27,0],[18,1,18,4],[18,9,18,16],[20,9,20,16],[22,9,22,16],[24,9,24,16],[26,1,26,4],[26,9,26,16],[3,0,8,0],[5,11,5,12],[5,17,5,19],[7,11,7,12],[7,17,7,18],[0,0,0,1],[0,2,0,8],[0,9,0,11],[0,12,0,20],[1,0,1,1],[1,2,1,6],[1,8,1,11],[1,12,1,13],[1,14,1,15],[1,16,1,17],[1,18,1,20]]}
["Stream:",null,"",null,null,null,null,null,null,"Location:",null,null,""]
["Observers:",null,"",null,null,null,null,"Date:","",null,null,null,"Valley Type:",null,"",null,"Stream Type:",null,"",null,null,null,"This form is populated in RIVERMorph within the \"Ratios\" node by clicking on the \"Field Book\" button.  Copy the appropriate cells within the exported RIVERMorph \"Worksheet 2-4b\" and paste into cell A1.  These values are then automatically transferred to the \"Design Table\" column for the existing reach."]
[]
[]
[]
[null,"Streamflow: Estimated Mean Velocity at Bankfull Stage (ūbkf)",null,null,null,null,null,null,null,null,null,null,null,"ft/sec","Estimation Method"]
{"$rows_left_out":71}
{"sheet":"Existing Competence","index":6,"n_rows":34,"n_cols":14,"rows_kept":34,"cut":false,"hidden":false,"merged":[[0,13,3,21],[25,3,26,10],[27,3,28,10],[29,3,30,10],[31,3,32,10],[32,13,33,21],[33,6,33,7],[24,1,24,2],[24,3,24,10],[12,1,12,10],[13,1,13,2],[14,1,14,2],[15,1,15,2],[15,8,15,9],[17,1,17,10],[18,1,18,2],[19,1,19,10],[20,1,20,2],[21,6,21,7],[23,1,23,10],[8,1,8,2],[8,4,8,10],[9,1,9,2],[9,4,9,10],[10,1,10,2],[10,4,10,10],[7,1,7,2],[7,4,7,7],[1,3,1,6],[1,7,1,8],[1,9,1,10],[2,3,2,6],[2,7,2,8],[2,9,2,10],[3,3,3,6],[3,9,3,10],[4,1,4,10],[5,1,5,2],[5,4,5,10],[6,1,6,2],[6,4,6,10]]}
[null,null,null,null,null,null,null,null,null,null,null,null,null,"This form is populated in RIVERMorph within the \"Competence\" node by clicking on the \"Worksheet 3-14\" button.  Copy the appropriate cells within the exported RIVERMorph \"Worksheet 3-14\" and paste into cell A1.  These values are then automatically transferred to the \"Design Table\" column for the existing reach."]
[null,"Stream:  ",null,null,null,null,null,"Stream Type:"]
[null,"Location:  ",null,null,null,null,null,"Valley Type:"]
[null,"Observers:",null,null,null,null,null,null,"Date:"]
[null,"Enter Required Information for Existing Condition"]
[null,null,null,"D50","Riffle bed material D50 (mm)"]
{"$rows_left_out":29}
{"sheet":"Existing Bank Erosion","index":7,"n_rows":24,"n_cols":44,"rows_kept":24,"cut":false,"hidden":false,"merged":[[20,34,20,41],[20,43,20,50],[21,0,21,6],[22,0,22,6],[23,0,23,6],[20,0,20,6],[15,1,15,2],[16,1,16,2],[17,1,17,2],[18,1,18,2],[19,1,19,2],[14,1,14,2],[3,0,3,2],[4,0,4,2],[5,1,5,2],[6,1,6,2],[7,1,7,2],[8,1,8,2],[9,1,9,2],[10,1,10,2],[11,1,11,2],[12,1,12,2],[13,1,13,2],[2,2,2,4],[0,30,4,33],[0,2,0,5],[0,7,0,9],[1,0,1,1],[1,2,1,3],[1,4,1,5],[1,6,1,7]]}
["Stream:",null,null,null,null,null,"Location:",null,null,null,null,null,null,null,null,null,null,null,null,null,null,null,null,null,null,null,null,null,null,null,"This form is populated in RIVERMorph within the \"BEHI\" node by clicking on the \"Worksheet 3-13\" button.  Copy the appropriate cells within the exported RIVERMorph \"Worksheet 3-13\" and paste into cell A1.  These values are then automatically transferred to the \"Design Table\" column for the existing reach."]
["Graph Used:",null,null,null,"Total Stream Length (ft):",null,null,null,"Date:"]
["Observers:",null,null,null,null,"Valley Type:",null,null,"Stream Type:"]
["(1)",null,null,"(2)","(3)","(4)","(5)","(6)","(7)","(8)"]
["Station (ft)",null,null,"BEHI rating (Worksheet 5-16) (adjective)","NBS rating (Worksheet 5-17) (adjective)","Bank erosion rate (Figure 5-34 or 5-35) (ft/yr)","Length of bank (ft)","Study bank height (ft)","Erosion subtotal [(4)×(5)×(6)] (ft3/yr)","Erosion Rate (tons/yr/ft) {[(7)/27] × 1.3 / (5)}","NBS","VERY LOW","LOW","MOD","HIGH","EX","EX/EX"]
["1.",null,null,null,null,null,null,null,null,null,{"$f":"IF(E6=\"Very low\",1,IF(E6=\"Low\",2,IF(E6=\"Moderate\",3,IF(E6=\"high\",4,IF(E6=\"very high\",5,IF(E6=\"extreme\",6,\"\"))))))","v":""},{"$f":"0.0007*EXP(0.8538*K6)","v":{"$error":"#VALUE!"}},{"$f":"0.0082*EXP(0.7349*K6)","v":{"$error":"#VALUE!"}},{"$f":"0.0556*EXP(0.5057*K6)","v":{"$error":"#VALUE!"}},{"$f":"0.109*EXP(0.4159*K6)","v":{"$error":"#VALUE!"}},{"$f":"0.0642*EXP(0.9391*K6)","v":{"$error":"#VALUE!"}},{"$f":"0.8015*EXP(0.2061*K6)","v":{"$error":"#VALUE!"}}]
{"$rows_left_out":19}
{"sheet":"Reference a","index":8,"n_rows":88,"n_cols":23,"rows_kept":88,"cut":false,"hidden":false,"merged":[[1,22,6,26],[39,0,39,20],[85,0,85,20],[86,0,86,20],[87,0,87,20],[40,0,51,0],[50,10,50,16],[52,0,52,20],[53,0,70,0],[71,0,71,20],[72,0,83,0],[73,1,73,5],[82,10,82,16],[84,0,84,20],[20,0,20,20],[21,0,38,0],[2,0,19,0],[0,0,0,1],[0,2,0,8],[0,9,0,11],[0,12,0,20],[1,0,1,1],[1,2,1,6],[1,8,1,11],[1,12,1,13],[1,14,1,15],[1,16,1,17],[1,18,1,20]]}
["Stream:",null,null,null,null,null,null,null,null,"Location:"]
["Observers:",null,null,null,null,null,null,"Date:",null,null,null,null,"Valley Type:",null,null,null,"Stream Type:",null,null,null,null,null,"This form is populated in RIVERMorph within the \"Ratios\" node by clicking on the \"Field Book\" button.  Copy the appropriate cells within the exported RIVERMorph \"Worksheet 2-4a\" and paste into cell A1.  These values are then automatically transferred to the \"Design Table\" column for the reference reach."]
[]
[null,"Riffle Dimensions*, **, ***",null,null,null,null,"Mean","Min","Max","Riffle Dimensions & Dimensionless Ratios****",null,null,null,null,null,null,null,"Mean","Min","Max"]
[null,"Riffle Width (Wbkf)",null,null,null,null,null,null,null,"ft","Riffle Cross-Sectional Area (Abkf) (ft2)"]
[]
{"$rows_left_out":83}
{"sheet":"Reference b","index":9,"n_rows":76,"n_cols":23,"rows_kept":76,"cut":false,"hidden":false,"merged":[[68,17,68,18],[70,6,70,7],[72,1,72,3],[72,4,72,5],[72,6,72,7],[72,8,72,9],[72,12,72,13],[68,1,68,3],[68,4,68,5],[68,12,68,13],[68,14,68,15],[51,9,51,16],[53,9,53,16],[55,9,55,16],[64,17,64,18],[64,1,64,3],[64,4,64,5],[64,6,64,7],[64,8,64,9],[64,12,64,13],[62,12,62,13],[62,14,62,15],[62,17,62,18],[64,14,64,15],[62,1,62,3],[57,9,57,16],[59,0,59,20],[76,0,76,20],[70,8,70,9],[70,12,70,13],[70,14,70,15],[70,17,70,18],[72,17,72,18],[72,14,72,15],[62,4,62,5],[62,6,62,7],[61,0,73,0],[61,17,61,19],[66,14,66,15],[66,17,66,18],[70,1,70,3],[70,4,70,5],[66,8,66,9],[66,12,66,13],[62,8,62,9],[66,1,66,3],[66,4,66,5],[66,6,66,7],[68,6,68,7],[68,8,68,9],[29,0,56,0],[30,4,30,5],[1,0,1,1],[1,2,1,6],[1,8,1,11],[3,0,8,0],[5,11,5,12],[7,11,7,12],[9,0,9,20],[30,13,30,14],[32,4,32,5],[32,7,32,12],[32,13,32,14],[34,7,34,10],[35,7,35,10],[49,9,49,16],[28,0,28,20],[10,0,27,0],[18,1,18,4],[18,9,18,16],[20,9,20,16],[22,9,22,16],[24,9,24,16],[26,1,26,4],[26,9,26,16],[1,22,8,26],[0,0,0,1],[0,2,0,8],[0,9,0,11],[0,12,0,20],[1,12,1,13],[1,14,1,15],[1,16,1,17],[1,18,1,20],[5,17,5,19],[7,17,7,18]]}
["Stream:",null,null,null,null,null,null,null,null,"Location:"]
["Observers:",null,null,null,null,null,null,"Date:",null,null,null,null,"Valley Type:",null,null,null,"Stream Type:",null,null,null,null,null,"This form is populated in RIVERMorph within the \"Ratios\" node by clicking on the \"Field Book\" button.  Copy the appropriate cells within the exported RIVERMorph \"Worksheet 2-4b\" and paste into cell A1.  These values are then automatically transferred to the \"Design Table\" column for the reference reach."]
[]
[]
[]
[null,"Streamflow: Estimated Mean Velocity at Bankfull Stage (ubkf)",null,null,null,null,null,null,null,null,null,null,null,"ft/sec","Estimation Method"]
{"$rows_left_out":71}
{"sheet":"Reference Competence","index":10,"n_rows":34,"n_cols":14,"rows_kept":34,"cut":false,"hidden":false,"merged":[[23,1,23,10],[17,1,17,10],[18,1,18,2],[19,1,19,10],[20,1,20,2],[21,6,21,7],[6,1,6,2],[6,4,6,10],[13,1,13,2],[14,1,14,2],[15,1,15,2],[15,8,15,9],[2,9,2,10],[3,3,3,6],[3,9,3,10],[4,1,4,10],[5,1,5,2],[5,4,5,10],[32,13,33,21],[25,3,26,10],[27,3,28,10],[29,3,30,10],[31,3,32,10],[33,6,33,7],[0,13,3,21],[7,1,7,2],[24,1,24,2],[24,3,24,10],[12,1,12,10],[8,1,8,2],[8,4,8,10],[9,1,9,2],[9,4,9,10],[10,1,10,2],[10,4,10,10],[7,4,7,7],[1,7,1,8],[1,9,1,10],[2,3,2,6],[2,7,2,8]]}
[null,null,null,null,null,null,null,null,null,null,null,null,null,"This form is populated in RIVERMorph within the \"Competence\" node by clicking on the \"Worksheet 3-14\" button.  Copy the appropriate cells within the exported RIVERMorph \"Worksheet 3-14\" and paste into cell A1.  These values are then automatically transferred to the \"Design Table\" column for the reference reach."]
[null,"Stream:  ",null,null,null,null,null,"Stream Type:"]
[null,"Location:  ",null,null,null,null,null,"Valley Type:"]
[null,"Observers:",null,null,null,null,null,null,"Date:"]
[null,"Enter Required Information for Existing Condition"]
[null,null,null,"D50","Riffle bed material D50 (mm)"]
{"$rows_left_out":29}
{"sheet":"Reference Bank Erosion","index":11,"n_rows":24,"n_cols":44,"rows_kept":24,"cut":false,"hidden":false,"merged":[[16,1,16,2],[20,34,20,41],[20,43,20,50],[21,0,21,6],[22,0,22,6],[23,0,23,6],[20,0,20,6],[17,1,17,2],[18,1,18,2],[19,1,19,2],[9,1,9,2],[10,1,10,2],[11,1,11,2],[12,1,12,2],[13,1,13,2],[0,30,4,33],[15,1,15,2],[0,2,0,5],[0,7,0,9],[1,0,1,1],[1,2,1,3],[1,4,1,5],[1,6,1,7],[2,2,2,4],[14,1,14,2],[3,0,3,2],[4,0,4,2],[5,1,5,2],[6,1,6,2],[7,1,7,2],[8,1,8,2]]}
["Stream:",null,null,null,null,null,"Location:",null,null,null,null,null,null,null,null,null,null,null,null,null,null,null,null,null,null,null,null,null,null,null,"This form is populated in RIVERMorph within the \"BEHI\" node by clicking on the \"Worksheet 3-13\" button.  Copy the appropriate cells within the exported RIVERMorph \"Worksheet 3-13\" and paste into cell A1.  These values are then automatically transferred to the \"Design Table\" column for the reference reach."]
["Graph Used:",null,null,null,"Total Bank Length (ft):",null,null,null,"Date:"]
["Observers:",null,null,null,null,"Valley Type:",null,null,"Stream Type:"]
["(1)",null,null,"(2)","(3)","(4)","(5)","(6)","(7)","(8)"]
["Station (ft)",null,null,"BEHI rating (Worksheet 5-16) (adjective)","NBS rating (Worksheet 5-17) (adjective)","Bank erosion rate (Figure 5-34 or 5-35) (ft/yr)","Length of bank (ft)","Study bank height (ft)","Erosion subtotal [(4)×(5)×(6)] (ft3/yr)","Erosion Rate (tons/yr/ft) {[(7)/27] × 1.3 / (5)}","NBS","VERY LOW","LOW","MOD","HIGH","EX","EX/EX"]
["1.",null,null,null,null,null,null,null,null,null,{"$f":"IF(E6=\"Very low\",1,IF(E6=\"Low\",2,IF(E6=\"Moderate\",3,IF(E6=\"high\",4,IF(E6=\"very high\",5,IF(E6=\"extreme\",6,\"\"))))))","v":""},{"$f":"0.0007*EXP(0.8538*K6)","v":{"$error":"#VALUE!"}},{"$f":"0.0082*EXP(0.7349*K6)","v":{"$error":"#VALUE!"}},{"$f":"0.0556*EXP(0.5057*K6)","v":{"$error":"#VALUE!"}},{"$f":"0.109*EXP(0.4159*K6)","v":{"$error":"#VALUE!"}},{"$f":"0.0642*EXP(0.9391*K6)","v":{"$error":"#VALUE!"}},{"$f":"0.8015*EXP(0.2061*K6)","v":{"$error":"#VALUE!"}}]
{"$rows_left_out":18}